TAXAcode,Group1,Group2,Taxanomic Entity,Marker,Primer Name,Direction,Sequence (5' - 3'),Reference, LITdb-ID,Primer Pairing,(unused),(unused),(unused),(unused),(unused),(unused),Compilation Source ID,
T4000002,Crustacea,Copepoda,Calanoida,Mitochondrial COI,H2612-COI,Reverse,AGGCCTAGGAAATGTATAGGGAAA,Figueroa 2011,L000096,L592-RCOI,,ex1,ex2,ex3,ex4,ex5,WGIMT-compilation 2016,
T4000002,Crustacea,Copepoda,Calanoida,Mitochondrial COI,L592-RCOI,Forward,AACCTTAATACATCTTTTTATGATG,Figueroa 2011,L000096,H2612-COI,,ex1,ex2,ex3,ex4,ex5,WGIMT-compilation 2016,
T4000002,Crustacea,Copepoda,Calanoida,Mitochondrial COI,LCO-1703,Forward,CTATTTGATTGGAGGATTTGG,Hill et al. 2001,L000104,internal primer,,ex1,ex2,ex3,ex4,ex5,WGIMT-compilation 2016,
T4000002,Crustacea,Copepoda,Calanoida,Mitochondrial COI,LCO-1719,Forward,GGATTTGGTAACTGATTAGTGCC,Hill et al. 2001,L000104,internal primer,,ex1,ex2,ex3,ex4,ex5,WGIMT-compilation 2016,
T4000002,Crustacea,Copepoda,Calanoida,Nuclear 18S,18S-693R,Reverse,AAACCTCTGGCAAAACTACG,Bucklin et al. 2003,L000088,18SE,,ex1,ex2,ex3,ex4,ex5,WGIMT-compilation 2016,
T4000002,Crustacea,Copepoda,Calanoida,Nuclear 18S,F1665-18S,Forward,CCGTCGCTACTACCGATTGAACG,Machida (unpubl) in Figueroa 2011,L000096,R73-5.8S,,ex1,ex2,ex3,ex4,ex5,WGIMT-compilation 2016,
T4000002,Crustacea,Copepoda,Calanoida,Nuclear 18S,R73-5.8S,Reverse,GTGTCGATGTTCATGTGTCCTGC,Machida (unpubl) in Figueroa 2011,L000096,F1665-18S,,ex1,ex2,ex3,ex4,ex5,WGIMT-compilation 2016,
T4000033,Crustacea,Copepoda,Acartia,Mitochondrial 16S,16S-167,Forward,GACGAGAAGACCCTATGAAG,Bucklin et al. 1998,L000087,16sbr-H,,ex1,ex2,ex3,ex4,ex5,WGIMT-compilation 2016,
T4000033,Crustacea,Copepoda,Acartia,Mitochondrial 16S,16sbr-H,Reverse,CCGGTTTGAACTCAGATCATGT,Palumbi 1996,L000114,16S-167,,ex1,ex2,ex3,ex4,ex5,WGIMT-compilation 2016,
T4000033,Crustacea,Copepoda,Acartia,Nuclear ITS2,IST-5,Forward,GGAAGTAAAAGTCGTAACAAGG,White et al. 1990,L000123,ITS-4,,ex1,ex2,ex3,ex4,ex5,WGIMT-compilation 2016,
T4000033,Crustacea,Copepoda,Acartia,Nuclear ITS2,ITS-4,Reverse,TCCTCCGCTTATTGATATGC,White et al. 1990,L000123,IST-5,,ex1,ex2,ex3,ex4,ex5,WGIMT-compilation 2016,
T4000078,Crustacea,Copepoda,Pleuromamma,Mitochondrial COI,PLXI_VH,,CCAAACGTTTCTTTCTTCCC,Goetze 2011,L000100,PLXI_VL,,ex1,ex2,ex3,ex4,ex5,WGIMT-compilation 2016,
T4000078,Crustacea,Copepoda,Pleuromamma,Mitochondrial COI,PLXI_VL,,TCAGCCAGGGTCTTTAATTGG,Goetze 2011,L000100,PLXI_VH,,ex1,ex2,ex3,ex4,ex5,WGIMT-compilation 2016,
T4000082,Crustacea,Copepoda,Eurytemora,Mitochondrial 16S,16SA2,Forward,CCGGGT(CT)TCGCTAAGGTAG,Lee 2000,L000106,16SB2,,ex1,ex2,ex3,ex4,ex5,WGIMT-compilation 2016,
T4000082,Crustacea,Copepoda,Eurytemora,Mitochondrial 16S,16SB2,Reverse,CAACATCGAGGTCGCAGTAA,Lee 2000,L000106,16SA2,,ex1,ex2,ex3,ex4,ex5,WGIMT-compilation 2016,
T4000087,Crustacea,Copepoda,Clausocalanus,Mitochondrial COI,,Forward,GAGCCTGGTCAGGAATAATCG,Blanco-Bercial and Alvarez-Marques 2007,L000085,,,ex1,ex2,ex3,ex4,ex5,WGIMT-compilation 2016,
T4000087,Crustacea,Copepoda,Clausocalanus,Mitochondrial COI,,Reverse,GGTCTCCTCCTCCTCCAACAT,Blanco-Bercial and Alvarez-Marques 2007,L000085,,,ex1,ex2,ex3,ex4,ex5,WGIMT-compilation 2016,
T4000145,Crustacea,Copepoda,Calanus helgolandicus,Mitochondrial COI,ChelgCOI-F,Forward,GGCCAAAACAGGGAGAGATA,Papadopoulos et al. 2005,L000115,ChelgCOI-R,,ex1,ex2,ex3,ex4,ex5,WGIMT-compilation 2016,
T4000145,Crustacea,Copepoda,Calanus helgolandicus,Mitochondrial COI,ChelgCOI-R,Reverse,CGGGACTCAGTATAATTATTCGTCTA,Papadopoulos et al. 2005,L000115,ChelgCOI-F,,ex1,ex2,ex3,ex4,ex5,WGIMT-compilation 2016,
T4000174,Crustacea,Copepoda,Neocalanus cristatus,Mitochondrial cyt b,Necr- CYB-L1,Forward,TTGGTGGTGACTTGGTACAGTGG,Machida et al. 2004,L000108,,,ex1,ex2,ex3,ex4,ex5,WGIMT-compilation 2016,
T4000361,Crustacea,Copepoda,Eucalanidae,Mitochondrial 16S,16SAR,Forward,CGCCTGTTTATCAAAAACAT,Braga et al. 1999,L000086,16SCB,,ex1,ex2,ex3,ex4,ex5,WGIMT-compilation 2016,
T4000361,Crustacea,Copepoda,Eucalanidae,Mitochondrial 16S,16SCB,Reverse,ATTCAACATCGAGGTCACAA,Braga et al. 1999,L000086,16SAR,,ex1,ex2,ex3,ex4,ex5,WGIMT-compilation 2016,
T4000361,Crustacea,Copepoda,Eucalanidae,Mitochondrial COI,COI_RNI,Forward,GTAGT(AGCT)GTAAC(AT)GCTCATGC,Goetze and Bradford-Grieve 2005,L000101,COI_VH,,ex1,ex2,ex3,ex4,ex5,WGIMT-compilation 2016,
T4000361,Crustacea,Copepoda,Eucalanidae,Nuclear ITS2,ITS10R,Reverse,TACGGGCCTATCACCCTCTACG,Geerken and Wyngaard unpubl. Data in Goetze 2003,L999999,ITS3F,,ex1,ex2,ex3,ex4,ex5,WGIMT-compilation 2016,
T4000361,Crustacea,Copepoda,Eucalanidae,Nuclear ITS2,ITS3F,Forward,GCATCGATGAAGAACGCAGC,White et al. 1990,L000123,ITS10R,,ex1,ex2,ex3,ex4,ex5,WGIMT-compilation 2016,
T4001255,Crustacea,Copepoda,Paracalanidae,Nuclear Histone H3,H3aF,Forward,ATGGCTCGTACCAAGCAGACVGC,Colgan et al. 1998,L000091,H3aR,,ex1,ex2,ex3,ex4,ex5,WGIMT-compilation 2016,
T4001255,Crustacea,Copepoda,Paracalanidae,Nuclear Histone H3,H3aR,Reverse,ATATCCTTRGGCATRATRGTGAC,Colgan et al. 1998,L000091,H3aF,,ex1,ex2,ex3,ex4,ex5,WGIMT-compilation 2016,
T4001900,Crustacea,Copepoda,Subeucalanus,Mitochondrial 16S,16S_SUB2,,AAGTGCTAAGGTAGCATAAT,Goetze 2003,L000099,,,ex1,ex2,ex3,ex4,ex5,WGIMT-compilation 2016,
T4001906,Crustacea,Copepoda,Pareucalanus,Mitochondrial 16S,16S_PAR1,,GCTAAGGTAGCATAATAATTAGTT,Goetze 2003,L000099,,,ex1,ex2,ex3,ex4,ex5,WGIMT-compilation 2016,
T4001908,Crustacea,Copepoda,Diaptomidae,Nuclear 18S,18S-1F,Forward,AACCTGGTTGATCCTGCCAGT,Thum 2004,L000120,18S-1R,,ex1,ex2,ex3,ex4,ex5,WGIMT-compilation 2016,
T4001908,Crustacea,Copepoda,Diaptomidae,Nuclear 18S,18S-1R,Reverse,TGGTGCCCTTCCGTCAATTCCT,Thum 2004,L000120,18S-1F,,ex1,ex2,ex3,ex4,ex5,WGIMT-compilation 2016,
T4001908,Crustacea,Copepoda,Diaptomidae,Nuclear 18S,18S-2F,Forward,CTGGTGCCAGCAGCCGCGG,Thum 2004,L000120,18S-2R,,ex1,ex2,ex3,ex4,ex5,WGIMT-compilation 2016,
T4001908,Crustacea,Copepoda,Diaptomidae,Nuclear 18S,18S-2R,Reverse,TTGATCCTTCTGCAGGTTCACCTAC,Thum 2004,L000120,18S-2F,,ex1,ex2,ex3,ex4,ex5,WGIMT-compilation 2016,
T4001938,Crustacea,Copepoda,Disseta,Nuclear 28S,F352-28S,Forward,AGACCGATAGTMAACAAGTACCGT,Machida and Tsuda 2010,L000109,,,ex1,ex2,ex3,ex4,ex5,WGIMT-compilation 2016,
T4001938,Crustacea,Copepoda,Disseta,Nuclear 28S,R768-28S,Reverse,TAGACTCCTTSGTCCGTGTTTCA,Machida and Tsuda 2010,L000109,,,ex1,ex2,ex3,ex4,ex5,WGIMT-compilation 2016,
T4003568,Crustacea,Copepoda,Mesocyclops,Nuclear 18S,18s329,Forward,TAATGATCCTTCCGCAGGTT,Spears et al. 1992,L000119,18sI-,,ex1,ex2,ex3,ex4,ex5,WGIMT-compilation 2016,
T4003568,Crustacea,Copepoda,Mesocyclops,Nuclear 18S,18sI-,Reverse,AACT(CT)AAAGGAATTGACGG,Spears et al. 1992,L000119,18s329,,ex1,ex2,ex3,ex4,ex5,WGIMT-compilation 2016,
